Target
Mannose-6-phosphate isomerase
Ligand
BDBM44446
Substrate
Meas. Tech.
ChEMBL_747525 (CHEMBL1777059)
IC50
1000±n/a nM
Citation
 Dahl, RBravo, YSharma, VIchikawa, MDhanya, RPHedrick, MBrown, BRascon, JVicchiarelli, MMangravita-Novo, AYang, LStonich, DSu, YSmith, LHSergienko, EFreeze, HHCosford, ND Potent, selective, and orally available benzoisothiazolone phosphomannose isomerase inhibitors as probes for congenital disorder of glycosylation Ia. J Med Chem 54:3661-8 (2011)  
Target
Name:
Mannose-6-phosphate isomerase
Synonyms:
MPI MPI_HUMAN PMI1
Type:
PROTEIN
Mol. Mass.:
46651.35
Organism:
Homo sapiens (Human)
Description:
ChEMBL_1448919
Residue:
423
  
Inhibitor
Name:
BDBM44446
Synonyms:
4-[2-[[(5Z)-5-(3-indolylidene)-4-(2-methoxyethyl)-1H-1,2,4-triazol-3-yl]thio]-1-oxoethyl]-1-piperazinecarboxylic acid ethyl ester MLS000092525 cid_5771379 ethyl 4-[2-[[(5Z)-5-indol-3-ylidene-4-(2-methoxyethyl)-1H-1,2,4-triazol-3-yl]sulfanyl]acetyl]piperazine-1-carboxylate | ethyl 4-[2-[[(5Z)-5-indol-3-ylidene-4-(2-methoxyethyl)-1H-1,2,4-triazol-3-yl]sulfanyl]ethanoyl]piperazine-1-carboxylate
Type:
Small organic molecule
Emp. Form.:
C22H28N6O4S
Mol. Mass.:
472.561
SMILES:
CCOC(=O)N1CCN(CC1)C(=O)CSc1nnc(-c2c[nH]c3ccccc23)n1CCOC
: