Target
Mannose-6-phosphate isomerase
Ligand
BDBM46732
Substrate
Meas. Tech.
ChEMBL_747525 (CHEMBL1777059)
IC50
1800±n/a nM
Citation
 Dahl, RBravo, YSharma, VIchikawa, MDhanya, RPHedrick, MBrown, BRascon, JVicchiarelli, MMangravita-Novo, AYang, LStonich, DSu, YSmith, LHSergienko, EFreeze, HHCosford, ND Potent, selective, and orally available benzoisothiazolone phosphomannose isomerase inhibitors as probes for congenital disorder of glycosylation Ia. J Med Chem 54:3661-8 (2011)  
Target
Name:
Mannose-6-phosphate isomerase
Synonyms:
MPI MPI_HUMAN PMI1
Type:
PROTEIN
Mol. Mass.:
46651.35
Organism:
Homo sapiens (Human)
Description:
ChEMBL_1448919
Residue:
423
  
Inhibitor
Name:
BDBM46732
Synonyms:
2-(4-chlorophenyl)-5-fluoranyl-1,2-benzothiazol-3-one MLS-0390975.0001 | cid_25241618
Type:
Small organic molecule
Emp. Form.:
C13H7ClFNOS
Mol. Mass.:
279.717
SMILES:
Fc1ccc2sn(-c3ccc(Cl)cc3)c(=O)c2c1
: