Target
P2X purinoceptor 7
Ligand
BDBM50344918
Substrate
Meas. Tech.
ChEMBL_748931 (CHEMBL1781379)
IC50
40±n/a nM
Citation
 Matasi, JJBrumfield, STulshian, DCzarnecki, MGreenlee, WGarlisi, CGQiu, HDevito, KChen, SCSun, YBertorelli, RGeiss, WLe, VDMartin, GSVellekoop, SAHaber, JAllard, ML Synthesis and SAR development of novel P2X7 receptor antagonists for the treatment of pain: part 1. Bioorg Med Chem Lett 21:3805-8 (2011)  
Target
Name:
P2X purinoceptor 7
Synonyms:
ATP receptor P2RX7_HUMAN P2X purinoceptor 7 (P2X7) P2Z receptor | Purinergic receptor
Type:
Protein
Mol. Mass.:
68602.85
Organism:
Homo sapiens (Human)
Description:
Q99572
Residue:
595
  
Inhibitor
Name:
BDBM50344918
Synonyms:
(R)-4-(1-(3,4-difluorobenzyl)-5-ethyl-7-isopropyl-4-oxo-4,5,7,8-tetrahydro-1H-imidazo[2,1-b]purin-2-yl)benzonitrile | CHEMBL1777943
Type:
Small organic molecule
Emp. Form.:
C26H24F2N6O
Mol. Mass.:
474.5052
SMILES:
CCN1C2=N[C@@H](CN2c2c(nc(-c3ccc(cc3)C#N)n2Cc2ccc(F)c(F)c2)C1=O)C(C)C
: