Target
Low molecular weight protein-tyrosine phosphatase A
Ligand
BDBM50345500
Substrate
Meas. Tech.
ChEMBL_751030 (CHEMBL1786815)
Ki
22500±n/a nM
Citation
 Chandra, KDutta, DMitra, ADas, AKBasak, A Design, synthesis and inhibition activity of a novel cyclic enediyne amino acid conjugates against MPtpA. Bioorg Med Chem 19:3274-9 (2011)  
Target
Name:
Low molecular weight protein-tyrosine phosphatase A
Synonyms:
PTPA_MYCTU Probable low molecular weight protein-tyrosine-phosphatase mptpA | ptpA
Type:
Hydrolase
Mol. Mass.:
17891.84
Organism:
Mycobacterium tuberculosis
Description:
Residue:
163
  
Inhibitor
Name:
BDBM50345500
Synonyms:
6-oxo-1,2,9,10-tetradehydro-3,4,5,6-tetrahydro-5-benzazacyclododecine-7-carboxylic acid | CHEMBL1784316
Type:
Small organic molecule
Emp. Form.:
C16H11NO3
Mol. Mass.:
265.2634
SMILES:
OC(=O)C1=C/C#Cc2ccccc2C#CCCNC\1=O
: