Target
Neutrophil collagenase
Ligand
BDBM8465
Substrate
Meas. Tech.
ChEMBL_753769 (CHEMBL1799650)
IC50
7.7±n/a nM
Citation
 Nuti, ECasalini, FSantamaria, SGabelloni, PBendinelli, SDa Pozzo, ECosta, BMarinelli, LLa Pietra, VNovellino, EMargarida Bernardo, MFridman, RDa Settimo, FMartini, CRossello, A Synthesis and biological evaluation in U87MG glioma cells of (ethynylthiophene)sulfonamido-based hydroxamates as matrix metalloproteinase inhibitors. Eur J Med Chem 46:2617-29 (2011)  
Target
Name:
Neutrophil collagenase
Synonyms:
CLG1 MMP8 Matrix metalloproteinase-8 PMNL collagenase | PMNL-CL
Type:
Enzyme
Mol. Mass.:
53413.48
Organism:
Homo sapiens (Human)
Description:
P22894
Residue:
467
  
Inhibitor
Name:
BDBM8465
Synonyms:
(2R)-N-hydroxy-2-[(4-methoxybenzene)(pyridin-3-ylmethyl)sulfonamido]-3-methylbutanamide CGS 27023 CHEMBL514138 | hydroxamate analogue 1
Type:
Small organic molecule
Emp. Form.:
C18H23N3O5S
Mol. Mass.:
393.457
SMILES:
COc1ccc(cc1)S(=O)(=O)N(Cc1cccnc1)[C@H](C(C)C)C(=O)NO
: