Target
Glycogen synthase kinase-3 beta
Ligand
BDBM7878
Substrate
Meas. Tech.
ChEMBL_755831 (CHEMBL1803565)
IC50
2500±n/a nM
Citation
 Perez, DIPalomo, VPérez, CGil, CDans, PDLuque, FJConde, SMartínez, A Switching reversibility to irreversibility in glycogen synthase kinase 3 inhibitors: clues for specific design of new compounds. J Med Chem 54:4042-56 (2011)  
Target
Name:
Glycogen synthase kinase-3 beta
Synonyms:
GSK-3 beta GSK3B Glycogen synthase kinase 3 beta (GSK3B) Glycogen synthase kinase-3 beta (GSK-3B) Glycogen synthase kinase-3 beta (GSK3B) Glycogen synthase kinase-3beta (GSK3B) | Serine/threonine-protein kinase GSK3B
Type:
Enzyme
Mol. Mass.:
46756.38
Organism:
Homo sapiens (Human)
Description:
P49841
Residue:
420
  
Inhibitor
Name:
BDBM7878
Synonyms:
2-bromo-1-(4-methylphenyl)ethan-1-one | Halomethyl Phenyl Ketone deriv. 26
Type:
Small organic molecule
Emp. Form.:
C9H9BrO
Mol. Mass.:
213.071
SMILES:
Cc1ccc(cc1)C(=O)CBr
: