Target
Interferon-induced, double-stranded RNA-activated protein kinase
Ligand
BDBM50230828
Substrate
Meas. Tech.
ChEMBL_756675 (CHEMBL1805140)
IC50
250±n/a nM
Citation
 Bryk, RWu, KRaimundo, BCBoardman, PEChao, PConn, GLAnderson, ECole, JLDuffy, NPNathan, CGriffin, JH Identification of new inhibitors of protein kinase R guided by statistical modeling. Bioorg Med Chem Lett 21:4108-14 (2011)  
Target
Name:
Interferon-induced, double-stranded RNA-activated protein kinase
Synonyms:
E2AK2_HUMAN Eukaryotic translation initiation factor 2-alpha kinase 2 P1/eIF-2A protein kinase PRKR Protein kinase RNA-activated eIF-2A protein kinase 2 | p68 kinase
Type:
PROTEIN
Mol. Mass.:
62104.61
Organism:
Homo sapiens (Human)
Description:
ChEMBL_1467743
Residue:
551
  
Inhibitor
Name:
BDBM50230828
Synonyms:
5-(4-fluorophenyl)-2-ureidothiophene-3-carboxamide [5-(p-fluorophenyl)-2-ureido]thiophene-3-carboxamide
Type:
Small organic molecule
Emp. Form.:
C12H10FN3O2S
Mol. Mass.:
279.29
SMILES:
NC(=O)Nc1sc(cc1C(N)=O)-c1ccc(F)cc1
: