Target
Aurora kinase A
Ligand
BDBM31533
Substrate
Meas. Tech.
ChEMBL_757718 (CHEMBL1809662)
IC50
312±n/a nM
Citation
 Caldarelli, MAngiolini, MDisingrini, TDonati, DGuanci, MNuvoloni, SPosteri, HQuartieri, FSilvagni, MColombo, R Synthesis and SAR of new pyrazolo[4,3-h]quinazoline-3-carboxamide derivatives as potent and selective MPS1 kinase inhibitors. Bioorg Med Chem Lett 21:4507-11 (2011)  
Target
Name:
Aurora kinase A
Synonyms:
AIK ARK-1 AURA AURKA_HUMAN Aurora 2 Aurora kinase A (AURKA) Aurora kinase A (Aurora-2) Aurora/IPL1-related kinase 1 Breast tumor-amplified kinase IAK1 STK15 GN Serine/threonine kinase 15 Serine/threonine-protein kinase 6 Serine/threonine-protein kinase aurora-A aurora-2 | hARK1
Type:
Serine/threonine-protein kinase
Mol. Mass.:
45830.98
Organism:
Homo sapiens (Human)
Description:
O14965
Residue:
403
  
Inhibitor
Name:
BDBM31533
Synonyms:
pyrazolo[4,3-h]quinazoline-3-carboxamide, 16
Type:
Small organic molecule
Emp. Form.:
C18H18N6O
Mol. Mass.:
334.3751
SMILES:
CNC(=O)c1nn(C)c-2c1CCc1cnc(Nc3ccccc3)nc-21
: