Target
Phosphatidylinositol 4,5-bisphosphate 3-kinase catalytic subunit gamma isoform
Ligand
BDBM50349628
Substrate
Meas. Tech.
ChEMBL_760020 (CHEMBL1810296)
IC50
18±n/a nM
Citation
 Dehnhardt, CMVenkatesan, AMChen, ZDelos-Santos, EAyral-Kaloustian, SBrooijmans, NYu, KHollander, IFeldberg, LLucas, JMallon, R Identification of 2-oxatriazines as highly potent pan-PI3K/mTOR dual inhibitors. Bioorg Med Chem Lett 21:4773-8 (2011)  
Target
Name:
Phosphatidylinositol 4,5-bisphosphate 3-kinase catalytic subunit gamma isoform
Synonyms:
PI3-kinase p110 subunit gamma PI3Kgamma PK3CG_HUMAN Phosphatidylinositol 4,5-bisphosphate 3-kinase (PI3K) Phosphatidylinositol 4,5-bisphosphate 3-kinase catalytic subunit gamma (PI3Kgamma) Phosphatidylinositol 4,5-bisphosphate 3-kinase catalytic subunit gamma isoform (PI3K) Phosphatidylinositol-4,5-bisphosphate 3-kinase catalytic subunit gamma isoform Phosphoinositide 3-kinases gamma (PI3K gamma) p120-PI3K
Type:
Enzyme Subunit
Mol. Mass.:
126470.30
Organism:
Homo sapiens (Human)
Description:
P48736
Residue:
1102
  
Inhibitor
Name:
BDBM50349628
Synonyms:
CHEMBL1808986
Type:
Small organic molecule
Emp. Form.:
C29H38N8O4
Mol. Mass.:
562.6632
SMILES:
CC(C)Oc1nc(nc(n1)-c1ccc(NC(=O)Nc2ccc(cc2)C(=O)N(C)CCN(C)C)cc1)N1CCOCC1
: