Target
Mu-type opioid receptor
Ligand
BDBM50350961
Substrate
Meas. Tech.
ChEMBL_763653 (CHEMBL1820179)
Ki
112±n/a nM
Citation
 Verhoest, PRBasak, ASParikh, VHayward, MKauffman, GWParadis, VMcHardy, SFMcLean, SGrimwood, SSchmidt, AWVanase-Frawley, MFreeman, JVan Deusen, JCox, LWong, DLiras, S Design and discovery of a selective small molecule¿ opioid antagonist (2-methyl-N-((2'-(pyrrolidin-1-ylsulfonyl)biphenyl-4-yl)methyl)propan-1-amine, PF-4455242). J Med Chem 54:5868-77 (2011)  
Target
Name:
Mu-type opioid receptor
Synonyms:
M-OR-1 MOR-1 MUOR1 Mu opiate receptor OPRM1 hMOP | mu-type opioid receptor isoform MOR-1
Type:
G Protein-Coupled Receptor (GPCR)
Mol. Mass.:
44789.51
Organism:
Homo sapiens (Human)
Description:
P35372
Residue:
400
  
Inhibitor
Name:
BDBM50350961
Synonyms:
CHEMBL1818325
Type:
Small organic molecule
Emp. Form.:
C25H33FN2O3S
Mol. Mass.:
460.605
SMILES:
OCCC1CCN(Cc2ccc(cc2F)-c2ccccc2S(=O)(=O)N2CCCCC2)CC1
: