Target
Hepatocyte growth factor receptor
Ligand
BDBM50295730
Substrate
Meas. Tech.
ChEMBL_764847 (CHEMBL1826790)
IC50
900±n/a nM
Citation
 Xie, QQZhong, LPan, YLWang, XYZhou, JPDi-Wu, LHuang, QWang, YLYang, LLXie, HZYang, SY Combined SVM-based and docking-based virtual screening for retrieving novel inhibitors of c-Met. Eur J Med Chem 46:3675-80 (2011)  
Target
Name:
Hepatocyte growth factor receptor
Synonyms:
Hepatocyte growth factor receptor Hepatocyte growth factor receptor (c-MET) MET Met proto-oncogene (hepatocyte growth factor receptor) Tyrosine-protein kinase Met (c-Met) c-Met kinase
Type:
Protein
Mol. Mass.:
155559.73
Organism:
Homo sapiens (Human)
Description:
P08581
Residue:
1390
  
Inhibitor
Name:
BDBM50295730
Synonyms:
1-(2-chlorophenylsulfonyl)-1H-pyrrolo[3,2-b]pyridine | CHEMBL554510
Type:
Small organic molecule
Emp. Form.:
C13H9ClN2O2S
Mol. Mass.:
292.741
SMILES:
Clc1ccccc1S(=O)(=O)n1ccc2ncccc12
: