Target
Signal transducer and activator of transcription 3
Ligand
BDBM50353441
Substrate
Meas. Tech.
ChEMBL_769098 (CHEMBL1832655)
IC50
35000±n/a nM
Citation
 Page, BDFletcher, SYue, PLi, ZZhang, XSharmeen, SDatti, AWrana, JLTrudel, SSchimmer, ADTurkson, JGunning, PT Identification of a non-phosphorylated, cell permeable, small molecule ligand for the Stat3 SH2 domain. Bioorg Med Chem Lett 21:5605-9 (2011)  
Target
Name:
Signal transducer and activator of transcription 3
Synonyms:
Acute-phase response factor STAT3 alpha Signal transducer and activator of transcription 3 Transcription Factor STAT3
Type:
Cytosolic Transcription Factor
Mol. Mass.:
88050.28
Organism:
Mus musculus (mouse)
Description:
Bacterially expressed protein was used in the FP assay.
Residue:
770
  
Inhibitor
Name:
BDBM50353441
Synonyms:
CHEMBL1829786
Type:
Small organic molecule
Emp. Form.:
C30H34N2O6S
Mol. Mass.:
550.666
SMILES:
CN(CC(=O)N(Cc1ccc(cc1)C1CCCCC1)c1ccc(C(O)=O)c(O)c1)S(=O)(=O)c1ccc(C)cc1
: