Target
Cytochrome P450 3A4
Ligand
BDBM50355392
Substrate
Meas. Tech.
ChEMBL_772032 (CHEMBL1837641)
IC50
1100±n/a nM
Citation
 Guagnano, VFuret, PSpanka, CBordas, VLe Douget, MStamm, CBrueggen, JJensen, MRSchnell, CSchmid, HWartmann, MBerghausen, JDrueckes, PZimmerlin, ABussiere, DMurray, JGraus Porta, D Discovery of 3-(2,6-dichloro-3,5-dimethoxy-phenyl)-1-{6-[4-(4-ethyl-piperazin-1-yl)-phenylamino]-pyrimidin-4-yl}-1-methyl-urea (NVP-BGJ398), a potent and selective inhibitor of the fibroblast growth factor receptor family of receptor tyrosine kinase. J Med Chem 54:7066-83 (2011)  
Target
Name:
Cytochrome P450 3A4
Synonyms:
Albendazole monooxygenase CP3A4_HUMAN CYP3A4 CYPIIIA4 Cytochrome P450 3A4 (CYP3A4) Nifedipine oxidase Taurochenodeoxycholate 6-alpha-hydroxylase
Type:
Enzyme
Mol. Mass.:
57349.57
Organism:
Homo sapiens (Human)
Description:
Residue:
503
  
Inhibitor
Name:
BDBM50355392
Synonyms:
CHEMBL1834658
Type:
Small organic molecule
Emp. Form.:
C25H29Cl2N7O3
Mol. Mass.:
546.449
SMILES:
COc1cc(OC)c(Cl)c(NC(=O)N(C)c2cc(Nc3cccc(c3)N3CCN(C)CC3)ncn2)c1Cl
: