Target
Tyrosine-protein kinase ABL1
Ligand
BDBM50355393
Substrate
Meas. Tech.
ChEMBL_772083 (CHEMBL1837849)
IC50
2300±n/a nM
Citation
 Guagnano, VFuret, PSpanka, CBordas, VLe Douget, MStamm, CBrueggen, JJensen, MRSchnell, CSchmid, HWartmann, MBerghausen, JDrueckes, PZimmerlin, ABussiere, DMurray, JGraus Porta, D Discovery of 3-(2,6-dichloro-3,5-dimethoxy-phenyl)-1-{6-[4-(4-ethyl-piperazin-1-yl)-phenylamino]-pyrimidin-4-yl}-1-methyl-urea (NVP-BGJ398), a potent and selective inhibitor of the fibroblast growth factor receptor family of receptor tyrosine kinase. J Med Chem 54:7066-83 (2011)  
Target
Name:
Tyrosine-protein kinase ABL1
Synonyms:
ABL ABL1_HUMAN JTK7 Proto-oncogene tyrosine-protein kinase ABL1 Tyrosine-protein kinase ABL V-abl Abelson murine leukemia viral oncogene homolog 1 p150 | tyrosine-protein kinase ABL1 isoform a
Type:
Enzyme
Mol. Mass.:
122897.30
Organism:
Homo sapiens (Human)
Description:
P00519
Residue:
1130
  
Inhibitor
Name:
BDBM50355393
Synonyms:
BGJ398 US9434697, BGJ398 | US9730931, BGJ398
Type:
Small organic molecule
Emp. Form.:
C26H31Cl2N7O3
Mol. Mass.:
560.475
SMILES:
CCN1CCN(CC1)c1ccc(Nc2cc(ncn2)N(C)C(=O)Nc2c(Cl)c(OC)cc(OC)c2Cl)cc1
: