Target
Acetylcholinesterase
Ligand
BDBM50327939
Substrate
Meas. Tech.
ChEMBL_785863 (CHEMBL1921132)
IC50
10500±n/a nM
Citation
 Korabecny, JMusilek, KZemek, FHorova, AHolas, ONepovimova, EOpletalova, VHroudova, JFisar, ZJung, YSKuca, K Synthesis and in vitro evaluation of 7-methoxy-N-(pent-4-enyl)-1,2,3,4-tetrahydroacridin-9-amine-new tacrine derivate with cholinergic properties. Bioorg Med Chem Lett 21:6563-6 (2011)  
Target
Name:
Acetylcholinesterase
Synonyms:
ACES_HUMAN Acetylcholinesterase (AChE) | Acetylcholinesterase (human AChE)
Type:
Enzyme
Mol. Mass.:
67792.70
Organism:
Homo sapiens (Human)
Description:
P22303
Residue:
614
  
Inhibitor
Name:
BDBM50327939
Synonyms:
7-methoxytacrine | CHEMBL1256415
Type:
Small organic molecule
Emp. Form.:
C14H16N2O
Mol. Mass.:
228.2896
SMILES:
COc1ccc2nc3CCCCc3c(N)c2c1
: