Target
Heat shock protein HSP 90-beta
Ligand
BDBM50357460
Substrate
Meas. Tech.
ChEMBL_787208 (CHEMBL1918878)
IC50
900±n/a nM
Citation
 Vallée, FCarrez, CPilorge, FDupuy, AParent, ABertin, LThompson, FFerrari, PFassy, FLamberton, AThomas, AArrebola, RGuerif, SRohaut, ACertal, VRuxer, JMGouyon, TDelorme, CJouanen, ADumas, JGrépin, CCombeau, CGoulaouic, HDereu, NMikol, VMailliet, PMinoux, H Tricyclic series of heat shock protein 90 (Hsp90) inhibitors part I: discovery of tricyclic imidazo[4,5-c]pyridines as potent inhibitors of the Hsp90 molecular chaperone. J Med Chem 54:7206-19 (2011)  
Target
Name:
Heat shock protein HSP 90-beta
Synonyms:
HS90B_HUMAN HSP 90 HSP90B HSPCB Heat shock protein HSP 90 (Hsp90)
Type:
Molecular Chaperone
Mol. Mass.:
83229.45
Organism:
Homo sapiens (Human)
Description:
P08238
Residue:
724
  
Inhibitor
Name:
BDBM50357460
Synonyms:
CHEMBL1917729
Type:
Small organic molecule
Emp. Form.:
C25H18N6O
Mol. Mass.:
418.45
SMILES:
Nc1cc(ccn1)C(=O)NC1c2ccccc2-c2c1cccc2-c1nc2ccncc2[nH]1
: