Target
Cholinesterase
Ligand
BDBM50357945
Substrate
Meas. Tech.
ChEMBL_787088 (CHEMBL1918655)
IC50
119000±n/a nM
Citation
 Martins, CCarreiras, MCLeón, Rde los Ríos, CBartolini, MAndrisano, VIriepa, IMoraleda, IGálvez, EGarcía, MEgea, JSamadi, AChioua, MMarco-Contelles, J Synthesis and biological assessment of diversely substituted furo[2,3-b]quinolin-4-amine and pyrrolo[2,3-b]quinolin-4-amine derivatives, as novel tacrine analogues. Eur J Med Chem 46:6119-30 (2011)  
Target
Name:
Cholinesterase
Synonyms:
Acylcholine acylhydrolase Butyrylcholine esterase (BChE) Butyrylcholinesterase (BuChE) CHLE_HUMAN Cholinesterases Pseudocholinesterase
Type:
Homotetramer
Mol. Mass.:
68422.27
Organism:
Homo sapiens (Human)
Description:
P06276
Residue:
602
  
Inhibitor
Name:
BDBM50357945
Synonyms:
CHEMBL1916770
Type:
Small organic molecule
Emp. Form.:
C18H18N2O
Mol. Mass.:
278.3483
SMILES:
Cc1ccc(cc1)-c1cc2c(N)c3CCCCc3nc2o1
: