Target
Metabotropic glutamate receptor 4
Ligand
BDBM50358180
Substrate
Meas. Tech.
ChEMBL_788856 (CHEMBL1924926)
EC50
226±n/a nM
Citation
 Jones, CKEngers, DWThompson, ADField, JRBlobaum, ALLindsley, SRZhou, YGogliotti, RDJadhav, SZamorano, RBogenpohl, JSmith, YMorrison, RDaniels, JSWeaver, CDConn, PJLindsley, CWNiswender, CMHopkins, CR Discovery, synthesis, and structure-activity relationship development of a series of N-4-(2,5-dioxopyrrolidin-1-yl)phenylpicolinamides (VU0400195, ML182): characterization of a novel positive allosteric modulator of the metabotropic glutamate receptor 4 (mGlu(4)) with oral efficacy in an antiparkin J Med Chem 54:7639-47 (2011)  
Target
Name:
Metabotropic glutamate receptor 4
Synonyms:
GPRC1D GRM4_HUMAN MGLUR4 Metabotropic glutamate receptor 4 (mGlu4) metabotropic glutamate 4
Type:
Protein
Mol. Mass.:
101899.95
Organism:
Homo sapiens (Human)
Description:
Q14833
Residue:
912
  
Inhibitor
Name:
BDBM50358180
Synonyms:
CHEMBL1921852
Type:
Small organic molecule
Emp. Form.:
C17H12N2O6S2
Mol. Mass.:
404.417
SMILES:
O=C(Nc1ccc(cc1)N1S(=O)(=O)c2ccccc2S1(=O)=O)c1ccco1
: