Target
Serine/threonine-protein kinase mTOR
Ligand
BDBM50358206
Substrate
Meas. Tech.
ChEMBL_790078 (CHEMBL1925468)
Ki
6.3±n/a nM
Citation
 Sutherlin, DPBao, LBerry, MCastanedo, GChuckowree, IDotson, JFolks, AFriedman, LGoldsmith, RGunzner, JHeffron, TLesnick, JLewis, CMathieu, SMurray, JNonomiya, JPang, JPegg, NPrior, WWRouge, LSalphati, LSampath, DTian, QTsui, VWan, NCWang, SWei, BWiesmann, CWu, PZhu, BYOlivero, A Discovery of a potent, selective, and orally available class I phosphatidylinositol 3-kinase (PI3K)/mammalian target of rapamycin (mTOR) kinase inhibitor (GDC-0980) for the treatment of cancer. J Med Chem 54:7579-87 (2011)  
Target
Name:
Serine/threonine-protein kinase mTOR
Synonyms:
FK506-binding protein 12-rapamycin complex-associated protein 1 FRAP FRAP1 MTOR Mammalian Target of Rapamycin (mTOR) RAFT1 Rapamycin and FKBP12 target 1 Serine/threonine-protein kinase (mTOR) | mTORC2
Type:
Rapamycin target protein
Mol. Mass.:
288917.12
Organism:
Homo sapiens (Human)
Description:
P42345
Residue:
2549
  
Inhibitor
Name:
BDBM50358206
Synonyms:
CHEMBL1922091
Type:
Small organic molecule
Emp. Form.:
C23H31N9O2S
Mol. Mass.:
497.616
SMILES:
C[C@H](N)C(=O)N1CCN(Cc2sc3c(nc(nc3c2C)-c2cnc(N)nc2)N2CCOCC2)CC1
: