Target
Hepatocyte growth factor receptor
Ligand
BDBM50358295
Substrate
Meas. Tech.
ChEMBL_790945 (CHEMBL1925561)
IC50
4±n/a nM
Citation
 Ryu, JWHan, SYYun, JIChoi, SUJung, HHa, JDCho, SYLee, COKang, NSKoh, JSKim, HRLee, J Design and synthesis of triazolopyridazines substituted with methylisoquinolinone as selective c-Met kinase inhibitors. Bioorg Med Chem Lett 21:7185-8 (2011)  
Target
Name:
Hepatocyte growth factor receptor
Synonyms:
Hepatocyte growth factor receptor Hepatocyte growth factor receptor (c-MET) MET Met proto-oncogene (hepatocyte growth factor receptor) Tyrosine-protein kinase Met (c-Met) c-Met kinase
Type:
Protein
Mol. Mass.:
155559.73
Organism:
Homo sapiens (Human)
Description:
P08581
Residue:
1390
  
Inhibitor
Name:
BDBM50358295
Synonyms:
CHEMBL1922410
Type:
Small organic molecule
Emp. Form.:
C19H13N5OS
Mol. Mass.:
359.404
SMILES:
O=c1[nH]ccc2c(Cc3nnc4ccc(nn34)-c3ccsc3)cccc12
: