Target
Hepatocyte growth factor receptor
Ligand
BDBM50358302
Substrate
Meas. Tech.
ChEMBL_790945 (CHEMBL1925561)
IC50
4±n/a nM
Citation
 Ryu, JWHan, SYYun, JIChoi, SUJung, HHa, JDCho, SYLee, COKang, NSKoh, JSKim, HRLee, J Design and synthesis of triazolopyridazines substituted with methylisoquinolinone as selective c-Met kinase inhibitors. Bioorg Med Chem Lett 21:7185-8 (2011)  
Target
Name:
Hepatocyte growth factor receptor
Synonyms:
Hepatocyte growth factor receptor Hepatocyte growth factor receptor (c-MET) MET Met proto-oncogene (hepatocyte growth factor receptor) Tyrosine-protein kinase Met (c-Met) c-Met kinase
Type:
Protein
Mol. Mass.:
155559.73
Organism:
Homo sapiens (Human)
Description:
P08581
Residue:
1390
  
Inhibitor
Name:
BDBM50358302
Synonyms:
CHEMBL1922417
Type:
Small organic molecule
Emp. Form.:
C21H14N6O3
Mol. Mass.:
398.3743
SMILES:
[O-][N+](=O)c1cccc(c1)-c1ccc2nnc(Cc3cccc4c3cc[nH]c4=O)n2n1
: