Target
Hepatocyte growth factor receptor
Ligand
BDBM50358305
Substrate
Meas. Tech.
ChEMBL_790945 (CHEMBL1925561)
IC50
5±n/a nM
Citation
 Ryu, JWHan, SYYun, JIChoi, SUJung, HHa, JDCho, SYLee, COKang, NSKoh, JSKim, HRLee, J Design and synthesis of triazolopyridazines substituted with methylisoquinolinone as selective c-Met kinase inhibitors. Bioorg Med Chem Lett 21:7185-8 (2011)  
Target
Name:
Hepatocyte growth factor receptor
Synonyms:
Hepatocyte growth factor receptor Hepatocyte growth factor receptor (c-MET) MET Met proto-oncogene (hepatocyte growth factor receptor) Tyrosine-protein kinase Met (c-Met) c-Met kinase
Type:
Protein
Mol. Mass.:
155559.73
Organism:
Homo sapiens (Human)
Description:
P08581
Residue:
1390
  
Inhibitor
Name:
BDBM50358305
Synonyms:
CHEMBL1922420
Type:
Small organic molecule
Emp. Form.:
C22H17N5O2
Mol. Mass.:
383.4027
SMILES:
COc1cccc(c1)-c1ccc2nnc(Cc3cccc4c3cc[nH]c4=O)n2n1
: