Target
Receptor-type tyrosine-protein kinase FLT3
Ligand
BDBM50358289
Substrate
Meas. Tech.
ChEMBL_790947 (CHEMBL1925563)
IC50
>10000±n/a nM
Citation
 Ryu, JWHan, SYYun, JIChoi, SUJung, HHa, JDCho, SYLee, COKang, NSKoh, JSKim, HRLee, J Design and synthesis of triazolopyridazines substituted with methylisoquinolinone as selective c-Met kinase inhibitors. Bioorg Med Chem Lett 21:7185-8 (2011)  
Target
Name:
Receptor-type tyrosine-protein kinase FLT3
Synonyms:
CD135 FL cytokine receptor FLK2 FLT3 Fetal liver kinase-2 Fms-like tyrosine kinase 3 (Flt-3) STK-1 Stem cell tyrosine kinase 1
Type:
Enzyme
Mol. Mass.:
112888.62
Organism:
Homo sapiens (Human)
Description:
P36888
Residue:
993
  
Inhibitor
Name:
BDBM50358289
Synonyms:
CHEMBL1922405
Type:
Small organic molecule
Emp. Form.:
C21H15N5O
Mol. Mass.:
353.3767
SMILES:
O=c1[nH]ccc2c(Cc3nnc4ccc(nn34)-c3ccccc3)cccc12
: