Target
High affinity nerve growth factor receptor
Ligand
BDBM50358289
Substrate
Meas. Tech.
ChEMBL_790948 (CHEMBL1925564)
IC50
>10000±n/a nM
Citation
 Ryu, JWHan, SYYun, JIChoi, SUJung, HHa, JDCho, SYLee, COKang, NSKoh, JSKim, HRLee, J Design and synthesis of triazolopyridazines substituted with methylisoquinolinone as selective c-Met kinase inhibitors. Bioorg Med Chem Lett 21:7185-8 (2011)  
Target
Name:
High affinity nerve growth factor receptor
Synonyms:
2.7.10.1 NTRK1 NTRK1_HUMAN Neurotrophic tyrosine kinase receptor type 1 Synonyms=MTC TRK1-transforming tyrosine kinase protein TRKA GN Trk-A Tropomyosin-related kinase A Tyrosine kinase receptor Tyrosine kinase receptor A Tyrosine kinase receptor A (Trk-A) gp140trk | p140-TrkA
Type:
Mol. Mass.:
87498.18
Organism:
Homo sapiens (Human)
Description:
P04629
Residue:
796
  
Inhibitor
Name:
BDBM50358289
Synonyms:
CHEMBL1922405
Type:
Small organic molecule
Emp. Form.:
C21H15N5O
Mol. Mass.:
353.3767
SMILES:
O=c1[nH]ccc2c(Cc3nnc4ccc(nn34)-c3ccccc3)cccc12
: