Target
Aurora kinase A
Ligand
BDBM50358288
Substrate
Meas. Tech.
ChEMBL_790949 (CHEMBL1925565)
IC50
>10000±n/a nM
Citation
 Ryu, JWHan, SYYun, JIChoi, SUJung, HHa, JDCho, SYLee, COKang, NSKoh, JSKim, HRLee, J Design and synthesis of triazolopyridazines substituted with methylisoquinolinone as selective c-Met kinase inhibitors. Bioorg Med Chem Lett 21:7185-8 (2011)  
Target
Name:
Aurora kinase A
Synonyms:
AIK ARK-1 AURA AURKA_HUMAN Aurora 2 Aurora kinase A (AURKA) Aurora kinase A (Aurora-2) Aurora/IPL1-related kinase 1 Breast tumor-amplified kinase IAK1 STK15 GN Serine/threonine kinase 15 Serine/threonine-protein kinase 6 Serine/threonine-protein kinase aurora-A aurora-2 | hARK1
Type:
Serine/threonine-protein kinase
Mol. Mass.:
45830.98
Organism:
Homo sapiens (Human)
Description:
O14965
Residue:
403
  
Inhibitor
Name:
BDBM50358288
Synonyms:
CHEMBL1922404
Type:
Small organic molecule
Emp. Form.:
C19H15N7O
Mol. Mass.:
357.3687
SMILES:
Cn1cc(cn1)-c1ccc2nnc(Cc3cccc4c3cc[nH]c4=O)n2n1
: