Target
Aurora kinase A
Ligand
BDBM50358289
Substrate
Meas. Tech.
ChEMBL_790949 (CHEMBL1925565)
IC50
>10000±n/a nM
Citation
 Ryu, JWHan, SYYun, JIChoi, SUJung, HHa, JDCho, SYLee, COKang, NSKoh, JSKim, HRLee, J Design and synthesis of triazolopyridazines substituted with methylisoquinolinone as selective c-Met kinase inhibitors. Bioorg Med Chem Lett 21:7185-8 (2011)  
Target
Name:
Aurora kinase A
Synonyms:
AIK ARK-1 AURA AURKA_HUMAN Aurora 2 Aurora kinase A (AURKA) Aurora kinase A (Aurora-2) Aurora/IPL1-related kinase 1 Breast tumor-amplified kinase IAK1 STK15 GN Serine/threonine kinase 15 Serine/threonine-protein kinase 6 Serine/threonine-protein kinase aurora-A aurora-2 | hARK1
Type:
Serine/threonine-protein kinase
Mol. Mass.:
45830.98
Organism:
Homo sapiens (Human)
Description:
O14965
Residue:
403
  
Inhibitor
Name:
BDBM50358289
Synonyms:
CHEMBL1922405
Type:
Small organic molecule
Emp. Form.:
C21H15N5O
Mol. Mass.:
353.3767
SMILES:
O=c1[nH]ccc2c(Cc3nnc4ccc(nn34)-c3ccccc3)cccc12
: