Target
Potassium voltage-gated channel subfamily H member 2
Ligand
BDBM50364034
Substrate
Meas. Tech.
ChEMBL_804952 (CHEMBL1954142)
IC50
1000±n/a nM
Citation
 Sun, ZYAsberom, TBara, TBennett, CBurnett, DChu, IClader, JCohen-Williams, MCole, DCzarniecki, MDurkin, JGallo, GGreenlee, WJosien, HHuang, XHyde, LJones, NKazakevich, ILi, HLiu, XLee, JMaccoss, MMandal, MBMcCracken, TNomeir, AMazzola, RPalani, AParker, EMPissarnitski, DAQin, JSong, LTerracina, GVicarel, MVoigt, JXu, RZhang, LZhang, QZhao, ZZhu, XZhu, Z Cyclic hydroxyamidines as amide isosteres: discovery of oxadiazolines and oxadiazines as potent and highly efficacious¿-secretase modulators in vivo. J Med Chem 55:489-502 (2012)  
Target
Name:
Potassium voltage-gated channel subfamily H member 2
Synonyms:
1,3-beta-glucan synthase component GLS2 ERG Eag-related protein 1 Ether-a-go-go-related gene (HERG) Ether-a-go-go-related gene potassium channel 1 Ether-a-go-go-related gene potassium channel 1 (hERG1) Ether-a-go-go-related protein 1 H-ERG KCNH2 Potassium voltage-gated channel subfamily H member 2 (hERG) Voltage-gated potassium channel subunit Kv11.1 hERG Potassium Channel 1 | putative potassium channel subunit
Type:
Multi-pass membrane protein
Mol. Mass.:
126672.65
Organism:
Homo sapiens (Human)
Description:
Q12809
Residue:
1159
  
Inhibitor
Name:
BDBM50364034
Synonyms:
CHEMBL1950535
Type:
Small organic molecule
Emp. Form.:
C25H23F3N4O2
Mol. Mass.:
468.4709
SMILES:
COc1cc(\C=C2/CCCN3[C@H](CON=C23)c2cc(F)c(F)c(F)c2)ccc1-n1cnc(C)c1
: