Target
Cannabinoid receptor 1
Ligand
BDBM50364947
Substrate
Meas. Tech.
ChEMBL_804069 (CHEMBL1952464)
Ki
226±n/a nM
Citation
 Cheng, YXPourashraf, MLuo, XSrivastava, SWalpole, CSalois, DSt-Onge, SPayza, KLessard, EYu, XHTomaszewski, MJ ¿-Carbolines: a novel class of cannabinoid agonists with high aqueous solubility and restricted CNS penetration. Bioorg Med Chem Lett 22:1619-24 (2012)  
Target
Name:
Cannabinoid receptor 1
Synonyms:
CANN6 CB-R CNR CNR1_HUMAN Cannabinoid receptor Cannabinoid receptor 1 (brain)
Type:
G Protein-Coupled Receptor (GPCR)
Mol. Mass.:
52868.96
Organism:
Homo sapiens (Human)
Description:
P21554
Residue:
472
  
Inhibitor
Name:
BDBM50364947
Synonyms:
CHEMBL1950490
Type:
Small organic molecule
Emp. Form.:
C23H31N3O2
Mol. Mass.:
381.5111
SMILES:
Cn1c2CCN(Cc2c2cc(ccc12)C(=O)N1CCCCC1)C1CCOCC1
: