Target
Matrix metalloproteinase-9
Ligand
BDBM50366198
Substrate
Meas. Tech.
ChEMBL_805642 (CHEMBL1960476)
IC50
1900±n/a nM
Citation
 Topai, ABreccia, PMinissi, FPadova, AMarini, SCerbara, I In silico scaffold evaluation and solid phase approach to identify new gelatinase inhibitors. Bioorg Med Chem 20:2323-37 (2012)  
Target
Name:
Matrix metalloproteinase-9
Synonyms:
67 kDa matrix metalloproteinase-9 92 kDa gelatinase CLG4B Gelatinase B MMP9 Matrix metalloproteinase 9 (MMP-9) Matrix metalloproteinase-9 (MMP9)
Type:
Enzyme
Mol. Mass.:
78452.28
Organism:
Homo sapiens (Human)
Description:
P14780
Residue:
707
  
Inhibitor
Name:
BDBM50366198
Synonyms:
CHEMBL1957596
Type:
Small organic molecule
Emp. Form.:
C17H16N2O5S
Mol. Mass.:
360.384
SMILES:
ONC(=O)[C@@H]1CCC(=O)N1S(=O)(=O)c1ccc(cc1)-c1ccccc1
: