Target
72 kDa type IV collagenase
Ligand
BDBM50026872
Substrate
Meas. Tech.
ChEMBL_805641 (CHEMBL1960475)
IC50
<0.100000±n/a nM
Citation
 Topai, ABreccia, PMinissi, FPadova, AMarini, SCerbara, I In silico scaffold evaluation and solid phase approach to identify new gelatinase inhibitors. Bioorg Med Chem 20:2323-37 (2012)  
Target
Name:
72 kDa type IV collagenase
Synonyms:
72 kDa gelatinase CLG4A Gelatinase A (MMP-2) MMP2_HUMAN Matrix metalloproteinase-2 (MMP 2) Matrix metalloproteinases 2 (MMP-2) | TBE-1
Type:
Enzyme
Mol. Mass.:
73870.36
Organism:
Homo sapiens (Human)
Description:
P08253
Residue:
660
  
Inhibitor
Name:
BDBM50026872
Synonyms:
CHEMBL1233506 | SC-74020
Type:
Small organic molecule
Emp. Form.:
C29H42N4O6S
Mol. Mass.:
574.732
SMILES:
CCCCCc1ccc(cc1)C(=O)Nc1ccc(cc1)S(=O)(=O)N(CCN1CCOCC1)[C@H](C(C)C)C(=O)NO
: