Target
Matrix metalloproteinase-9
Ligand
BDBM50366203
Substrate
Meas. Tech.
ChEMBL_805642 (CHEMBL1960476)
IC50
2±n/a nM
Citation
 Topai, ABreccia, PMinissi, FPadova, AMarini, SCerbara, I In silico scaffold evaluation and solid phase approach to identify new gelatinase inhibitors. Bioorg Med Chem 20:2323-37 (2012)  
Target
Name:
Matrix metalloproteinase-9
Synonyms:
67 kDa matrix metalloproteinase-9 92 kDa gelatinase CLG4B Gelatinase B MMP9 Matrix metalloproteinase 9 (MMP-9) Matrix metalloproteinase-9 (MMP9)
Type:
Enzyme
Mol. Mass.:
78452.28
Organism:
Homo sapiens (Human)
Description:
P14780
Residue:
707
  
Inhibitor
Name:
BDBM50366203
Synonyms:
CHEMBL1957601
Type:
Small organic molecule
Emp. Form.:
C17H18N2O6S2
Mol. Mass.:
410.465
SMILES:
COc1ccc(Oc2ccc(cc2)S(=O)(=O)N2CSC[C@H]2C(=O)NO)cc1
: