Target
Macrophage metalloelastase
Ligand
BDBM50366173
Substrate
Meas. Tech.
ChEMBL_805646 (CHEMBL1960480)
IC50
2500±n/a nM
Citation
 Topai, ABreccia, PMinissi, FPadova, AMarini, SCerbara, I In silico scaffold evaluation and solid phase approach to identify new gelatinase inhibitors. Bioorg Med Chem 20:2323-37 (2012)  
Target
Name:
Macrophage metalloelastase
Synonyms:
HME MMP12_HUMAN Matrix metalloproteinase-12 (MMP 12) Matrix metalloproteinase-12 (MMP12) | Matrix metalloproteinases 12 (MMP-12)
Type:
Enzyme
Mol. Mass.:
54012.99
Organism:
Homo sapiens (Human)
Description:
P39900
Residue:
470
  
Inhibitor
Name:
BDBM50366173
Synonyms:
CHEMBL1957604
Type:
Small organic molecule
Emp. Form.:
C16H16N2O5S2
Mol. Mass.:
380.439
SMILES:
ONC(=O)[C@@H]1CS(=O)CN1S(=O)(=O)c1ccc(cc1)-c1ccccc1
: