Target
HLA class II histocompatibility antigen, DR beta 3 chain
Ligand
BDBM50287643
Substrate
Meas. Tech.
ChEBML_47860
IC50
3150±n/a nM
Citation
 Hanson, GJVuletich, JLBedell, LJBono, CPHoward, SCWelply, JKWoulfe, SLZacheis, ML Design of MHC class II (DR4) ligands using conformationally restricted imino acids at p3 and p5 Bioorg Med Chem Lett 6:1931-1936 (1996)    Article 
Target
Name:
HLA class II histocompatibility antigen, DR beta 3 chain
Synonyms:
DRB3_HUMAN HLA class II histocompatibility antigen, DRB3-1 beta chain Human leukocyte antigen DR beta chain | MHC class I antigen DRB3*1
Type:
PROTEIN
Mol. Mass.:
29969.73
Organism:
Homo sapiens (Human)
Description:
ChEMBL_47860
Residue:
266
  
Inhibitor
Name:
BDBM50287643
Synonyms:
(S)-3-({1-[(S)-2-(3-Cyclohexyl-propionylamino)-3-(3H-imidazol-4-yl)-propionyl]-piperidine-2-carbonyl}-amino)-4-{(S)-2-[(1S,2R)-2-hydroxy-1-(3-methyl-butylcarbamoyl)-propylcarbamoyl]-pyrrolidin-1-yl}-4-oxo-butyric acid | CHEMBL2373024
Type:
Small organic molecule
Emp. Form.:
C39H62N8O9
Mol. Mass.:
786.9578
SMILES:
CC(C)CCNC(=O)[C@@H](NC(=O)[C@@H]1CCCN1C(=O)[C@H](CC(O)=O)NC(=O)[C@@H]1CCCCN1C(=O)[C@H](Cc1c[nH]cn1)NC(=O)CCC1CCCCC1)[C@@H](C)O
: