Target
Collagenase 3
Ligand
BDBM50078567
Substrate
Meas. Tech.
ChEBML_101903
IC50
96±n/a nM
Citation
 Hanessian, SBouzbouz, SBoudon, ATucker, GCPeyroulan, D Picking the S1, S1' and S2' pockets of matrix metalloproteinases. A niche for potent acyclic sulfonamide inhibitors. Bioorg Med Chem Lett 9:1691-6 (1999)  
Target
Name:
Collagenase 3
Synonyms:
MMP-13 MMP13_HUMAN Matrix metalloproteinase-13 (MMP-13) | Matrix metalloproteinase-13 (MMP13)
Type:
Enzyme
Mol. Mass.:
53808.06
Organism:
Homo sapiens (Human)
Description:
P45452
Residue:
471
  
Inhibitor
Name:
BDBM50078567
Synonyms:
(S)-N-Hydroxy-2-[isobutyl-(4-methoxy-benzenesulfonyl)-amino]-butyramide | CHEMBL45357
Type:
Small organic molecule
Emp. Form.:
C15H24N2O5S
Mol. Mass.:
344.426
SMILES:
CC[C@H](N(CC(C)C)S(=O)(=O)c1ccc(OC)cc1)C(=O)NO
: