Target
Stromelysin-1
Ligand
BDBM50078567
Substrate
Meas. Tech.
ChEBML_101943
IC50
45±n/a nM
Citation
 Hanessian, SBouzbouz, SBoudon, ATucker, GCPeyroulan, D Picking the S1, S1' and S2' pockets of matrix metalloproteinases. A niche for potent acyclic sulfonamide inhibitors. Bioorg Med Chem Lett 9:1691-6 (1999)  
Target
Name:
Stromelysin-1
Synonyms:
MMP-3 MMP3_HUMAN Matrix metalloproteinase 3 Matrix metalloproteinase-3 (MMP-3) SL-1 Stromelysin 1 | Transin-1
Type:
Enzyme
Mol. Mass.:
53973.13
Organism:
Homo sapiens (Human)
Description:
P08254
Residue:
477
  
Inhibitor
Name:
BDBM50078567
Synonyms:
(S)-N-Hydroxy-2-[isobutyl-(4-methoxy-benzenesulfonyl)-amino]-butyramide | CHEMBL45357
Type:
Small organic molecule
Emp. Form.:
C15H24N2O5S
Mol. Mass.:
344.426
SMILES:
CC[C@H](N(CC(C)C)S(=O)(=O)c1ccc(OC)cc1)C(=O)NO
: