Target
72 kDa type IV collagenase
Ligand
BDBM8465
Substrate
Meas. Tech.
ChEBML_101933
IC50
15±n/a nM
Citation
 Hanessian, SBouzbouz, SBoudon, ATucker, GCPeyroulan, D Picking the S1, S1' and S2' pockets of matrix metalloproteinases. A niche for potent acyclic sulfonamide inhibitors. Bioorg Med Chem Lett 9:1691-6 (1999)  
Target
Name:
72 kDa type IV collagenase
Synonyms:
72 kDa gelatinase MMP-2 Matrix metalloproteinase-2 | Mmp2
Type:
PROTEIN
Mol. Mass.:
74091.47
Organism:
Mus musculus
Description:
ChEMBL_101933
Residue:
662
  
Inhibitor
Name:
BDBM8465
Synonyms:
(2R)-N-hydroxy-2-[(4-methoxybenzene)(pyridin-3-ylmethyl)sulfonamido]-3-methylbutanamide CGS 27023 CHEMBL514138 | hydroxamate analogue 1
Type:
Small organic molecule
Emp. Form.:
C18H23N3O5S
Mol. Mass.:
393.457
SMILES:
COc1ccc(cc1)S(=O)(=O)N(Cc1cccnc1)[C@H](C(C)C)C(=O)NO
: