Target
Plasminogen
Ligand
BDBM50074920
Substrate
Meas. Tech.
ChEBML_155604
Ki
40±n/a nM
Citation
 Garrett, GSMcPhail, SJTornheim, KCorrea, PEMcIver, JM Synthesis of potent and selective inhibitors of human plasma kallikrein. Bioorg Med Chem Lett 9:301-6 (1999)  
Target
Name:
Plasminogen
Synonyms:
PLMN_RAT Plasminogen | Plg
Type:
Protein
Mol. Mass.:
90541.87
Organism:
Rattus norvegicus
Description:
Q01177
Residue:
812
  
Inhibitor
Name:
BDBM50074920
Synonyms:
((R)-3-Phenyl-1-{(S)-2-phenyl-1-[3,3,3-trifluoro-1-(4-guanidino-benzyl)-2-oxo-propylcarbamoyl]-ethylcarbamoyl}-propyl)-carbamic acid adamantan-1-yl ester
Type:
Small organic molecule
Emp. Form.:
C41H48F3N6O5
Mol. Mass.:
761.8517
SMILES:
NC(=[NH2+])Nc1ccc(CC(NC(=O)[C@H](Cc2ccccc2)NC(=O)[C@@H](CCc2ccccc2)NC(=O)OC23CC4CC(CC(C4)C2)C3)C(=O)C(F)(F)F)cc1
: