Target
Plasminogen
Ligand
BDBM50074915
Substrate
Meas. Tech.
ChEBML_155604
Ki
80±n/a nM
Citation
 Garrett, GSMcPhail, SJTornheim, KCorrea, PEMcIver, JM Synthesis of potent and selective inhibitors of human plasma kallikrein. Bioorg Med Chem Lett 9:301-6 (1999)  
Target
Name:
Plasminogen
Synonyms:
PLMN_RAT Plasminogen | Plg
Type:
Protein
Mol. Mass.:
90541.87
Organism:
Rattus norvegicus
Description:
Q01177
Residue:
812
  
Inhibitor
Name:
BDBM50074915
Synonyms:
((R)-2-Methyl-1-{(S)-2-phenyl-1-[3,3,3-trifluoro-1-(4-guanidino-benzyl)-2-oxo-propylcarbamoyl]-ethylcarbamoyl}-propyl)-carbamic acid adamantan-1-yl ester
Type:
Small organic molecule
Emp. Form.:
C36H46F3N6O5
Mol. Mass.:
699.7823
SMILES:
CC(C)[C@@H](NC(=O)OC12CC3CC(CC(C3)C1)C2)C(=O)N[C@@H](Cc1ccccc1)C(=O)NC(Cc1ccc(NC(N)=[NH2+])cc1)C(=O)C(F)(F)F
: