Target
Bone morphogenetic protein 1
Ligand
BDBM8465
Substrate
Meas. Tech.
ChEBML_158894
IC50
3000±n/a nM
Citation
 Dankwardt, SMMartin, RLChan, CSVan Wart, HEWalker, KADelaet, NGRobinson, LA Amino acid derived sulfonamide hydroxamates as inhibitors of procollagen C-proteinase: solid-phase synthesis of ornithine analogues. Bioorg Med Chem Lett 11:2085-8 (2001)  
Target
Name:
Bone morphogenetic protein 1
Synonyms:
BMP-1 BMP1_HUMAN PCOLC Procollagen C-proteinase | mTld
Type:
PROTEIN
Mol. Mass.:
111254.03
Organism:
Homo sapiens (Human)
Description:
ChEMBL_518962
Residue:
986
  
Inhibitor
Name:
BDBM8465
Synonyms:
(2R)-N-hydroxy-2-[(4-methoxybenzene)(pyridin-3-ylmethyl)sulfonamido]-3-methylbutanamide CGS 27023 CHEMBL514138 | hydroxamate analogue 1
Type:
Small organic molecule
Emp. Form.:
C18H23N3O5S
Mol. Mass.:
393.457
SMILES:
COc1ccc(cc1)S(=O)(=O)N(Cc1cccnc1)[C@H](C(C)C)C(=O)NO
: