Target
Progesterone receptor
Ligand
BDBM50110509
Substrate
Meas. Tech.
ChEMBL_159075 (CHEMBL763207)
EC50
0.800000±n/a nM
Citation
 Zhang, PTerefenko, EAFensome, AZhang, ZZhu, YCohen, JWinneker, RWrobel, JYardley, J Potent nonsteroidal progesterone receptor agonists: synthesis and SAR study of 6-aryl benzoxazines. Bioorg Med Chem Lett 12:787-90 (2002)  
Target
Name:
Progesterone receptor
Synonyms:
NR3C3 PGR PRGR_HUMAN | progesterone
Type:
Protein
Mol. Mass.:
98979.52
Organism:
Homo sapiens (Human)
Description:
P06401
Residue:
933
  
Inhibitor
Name:
BDBM50110509
Synonyms:
4-(4,4-Dimethyl-2-trifluoromethyl-1,4-dihydro-2H-benzo[d][1,3]oxazin-6-yl)-thiophene-2-carbonitrile | CHEMBL167844
Type:
Small organic molecule
Emp. Form.:
C16H13F3N2OS
Mol. Mass.:
338.347
SMILES:
CC1(C)OC(Nc2ccc(cc12)-c1csc(c1)C#N)C(F)(F)F
: