Target
Progesterone receptor
Ligand
BDBM50126106
Substrate
Meas. Tech.
ChEMBL_159367 (CHEMBL856209)
IC50
100±n/a nM
Citation
 Zhang, PTerefenko, EAFensome, AWrobel, JWinneker, RZhang, Z Novel 6-aryl-1,4-dihydrobenzo[d]oxazine-2-thiones as potent, selective, and orally active nonsteroidal progesterone receptor agonists. Bioorg Med Chem Lett 13:1313-6 (2003)  
Target
Name:
Progesterone receptor
Synonyms:
NR3C3 PGR PRGR_HUMAN | progesterone
Type:
Protein
Mol. Mass.:
98979.52
Organism:
Homo sapiens (Human)
Description:
P06401
Residue:
933
  
Inhibitor
Name:
BDBM50126106
Synonyms:
3-(4,4-Dimethyl-2-thioxo-1,4-dihydro-2H-benzo[d][1,3]oxazin-6-yl)-5-trifluoromethoxy-benzonitrile | CHEMBL24689
Type:
Small organic molecule
Emp. Form.:
C18H13F3N2O2S
Mol. Mass.:
378.368
SMILES:
CC1(C)OC(=S)Nc2ccc(cc12)-c1cc(OC(F)(F)F)cc(c1)C#N
: