Target
Progesterone receptor
Ligand
BDBM50126146
Substrate
Meas. Tech.
ChEMBL_205980 (CHEMBL810909)
EC50
>10000±n/a nM
Citation
 Zhang, PTerefenko, EAFensome, AWrobel, JWinneker, RZhang, Z Novel 6-aryl-1,4-dihydrobenzo[d]oxazine-2-thiones as potent, selective, and orally active nonsteroidal progesterone receptor agonists. Bioorg Med Chem Lett 13:1313-6 (2003)  
Target
Name:
Progesterone receptor
Synonyms:
NR3C3 PGR PRGR_HUMAN | progesterone
Type:
Protein
Mol. Mass.:
98979.52
Organism:
Homo sapiens (Human)
Description:
P06401
Residue:
933
  
Inhibitor
Name:
BDBM50126146
Synonyms:
6-(3-Bromo-phenyl)-1,4,4-trimethyl-1,4-dihydro-benzo[d][1,3]oxazine-2-thione | CHEMBL25454
Type:
Small organic molecule
Emp. Form.:
C17H16BrNOS
Mol. Mass.:
362.284
SMILES:
CN1C(=S)OC(C)(C)c2cc(ccc12)-c1cccc(Br)c1
: