Target
Serine protease 1
Ligand
BDBM50120368
Substrate
Meas. Tech.
ChEBML_212190
IC50
72.0±n/a nM
Citation
 Sutton, JCBolton, SADavis, MEHartl, KSJacobson, BMathur, AOgletree, MLSlusarchyk, WAZahler, RSeiler, SMBisacchi, GS Solid-phase synthesis and SAR of 4-carboxy-2-azetidinone mechanism-based tryptase inhibitors. Bioorg Med Chem Lett 14:2233-9 (2004)  
Target
Name:
Serine protease 1
Synonyms:
Alpha-trypsin chain 1 Beta-trypsin PRSS1 TRP1 TRY1_HUMAN Thrombin & trypsin Trypsin I | Trypsin-1
Type:
Enzyme
Mol. Mass.:
26557.80
Organism:
Homo sapiens (Human)
Description:
P07477
Residue:
247
  
Inhibitor
Name:
BDBM50120368
Synonyms:
(2S,3R)-1-(4-tert-Butylcarbamoyl-piperazine-1-carbonyl)-3-(3-guanidino-propyl)-4-oxo-azetidine-2-carboxylic acid (R)-1-(4-tert-Butylcarbamoyl-piperazine-1-carbonyl)-3-(3-guanidino-propyl)-4-oxo-azetidine-2-carboxylic acid BMS-262084 | CHEMBL71037
Type:
Small organic molecule
Emp. Form.:
C18H31N7O5
Mol. Mass.:
425.4826
SMILES:
CC(C)(C)NC(=O)N1CCN(CC1)C(=O)N1[C@@H]([C@@H](CCCNC(N)=N)C1=O)C(O)=O
: