Target
Thromboxane-A synthase
Ligand
BDBM50028753
Substrate
Meas. Tech.
ChEBML_210444
IC50
>1000±n/a nM
Citation
 Tanouchi, TKawamura, MOhyama, IKajiwara, IIguchi, YOkada, TMiyamoto, TTaniguchi, KHayashi, MIizuka, KNakazawa, M Highly selective inhibitors of thromboxane synthetase. 2. Pyridine derivatives. J Med Chem 24:1149-55 (1982)  
Target
Name:
Thromboxane-A synthase
Synonyms:
CYP5 Cytochrome P450 5A1 TBXAS1 TXA synthase TXS Thromboxane A2 Synthase (P450 TxA2) Thromboxane prostanoid Thromboxane-A synthase
Type:
Enzyme
Mol. Mass.:
60524.67
Organism:
Homo sapiens (Human)
Description:
P24557
Residue:
533
  
Inhibitor
Name:
BDBM50028753
Synonyms:
7-Pyridin-4-yl-heptanoic acid; hydrochloride | CHEMBL537925
Type:
Small organic molecule
Emp. Form.:
C12H17NO2
Mol. Mass.:
207.2689
SMILES:
OC(=O)CCCCCCc1ccncc1
: