Target
Renin
Ligand
BDBM50367713
Substrate
Meas. Tech.
ChEBML_195781
IC50
6200±n/a nM
Citation
 Smith, CWSaneii, HHSawyer, TKPals, DTScahill, TAKamdar, BVLawson, JA Synthesis and renin inhibitory activity of angiotensinogen analogues having dehydrostatine, Leu psi [CH2S]Val, or Leu psi [CH2SO]Val at the P1-P1' cleavage site. J Med Chem 31:1377-82 (1988)  
Target
Name:
Renin
Synonyms:
Angiotensinogenase RENI_HUMAN
Type:
Enzyme
Mol. Mass.:
45058.99
Organism:
Homo sapiens (Human)
Description:
Residue:
406
  
Inhibitor
Name:
BDBM50367713
Synonyms:
CHEMBL1790122
Type:
Small organic molecule
Emp. Form.:
C57H82N16O10
Mol. Mass.:
1151.3622
SMILES:
CC[C@@H](C)[C@H](NC(=O)\C=C\[C@H](CC(C)C)NC(=O)[C@H](Cc1cnc[nH]1)NC(=O)[C@H](Cc1ccccc1)NC(=O)[C@H]1CCCN1C(=O)[C@H](Cc1cnc[nH]1)NC(=O)[C@H]1CCCN1)C(=O)N[C@@H](Cc1cnc[nH]1)C(=O)N[C@H](CCCCN)C(O)=O
: