Target
Tyrosine-protein kinase transforming protein Abl
Ligand
BDBM50292490
Substrate
Meas. Tech.
ChEBML_221791
IC50
63000±n/a nM
Citation
 Kruse, CHHolden, KGPritchard, MLFeild, JARieman, DJGreig, RGPoste, G Synthesis and evaluation of multisubstrate inhibitors of an oncogene-encoded tyrosine-specific protein kinase. 1. J Med Chem 31:1762-7 (1988)  
Target
Name:
Tyrosine-protein kinase transforming protein Abl
Synonyms:
ABL Tyrosine-protein kinase V-ABL
Type:
Enzyme
Mol. Mass.:
81895.89
Organism:
Abelson murine leukemia virus
Description:
P00521
Residue:
746
  
Inhibitor
Name:
BDBM50292490
Synonyms:
((2R,3S,4R,5R)-5-(6-amino-9H-purin-9-yl)-3,4-dihydroxytetrahydrofuran-2-yl)methyl 4-(methylsulfonyl)benzoate | CHEMBL520484
Type:
Small organic molecule
Emp. Form.:
C18H19N5O7S
Mol. Mass.:
449.438
SMILES:
CS(=O)(=O)c1ccc(cc1)C(=O)OC[C@H]1O[C@H]([C@H](O)[C@@H]1O)n1cnc2c(N)ncnc12
: