Target
Aromatase
Ligand
BDBM50014776
Substrate
Meas. Tech.
ChEBML_51212
EC50
9.4±n/a nM
Citation
 Jones, CDWinter, MAHirsch, KSStamm, NTaylor, HMHolden, HEDavenport, JDKrumkalns, EVSuhr, RG Estrogen synthetase inhibitors. 2. Comparison of the in vitro aromatase inhibitory activity for a variety of nitrogen heterocycles substituted with diarylmethane or diarylmethanol groups. J Med Chem 33:416-29 (1990)  
Target
Name:
Aromatase
Synonyms:
Arom CP19A_RAT Cyp19 Cytochrome P450 19A1 P-450AROM
Type:
PROTEIN
Mol. Mass.:
58418.09
Organism:
Rattus norvegicus
Description:
ChEMBL_51211
Residue:
508
  
Inhibitor
Name:
BDBM50014776
Synonyms:
1-[bis(4-chlorophenyl)(1H-imidazol-2-yl)methyl]-1H-imidazole | CHEMBL137604
Type:
Small organic molecule
Emp. Form.:
C19H14Cl2N4
Mol. Mass.:
369.247
SMILES:
Clc1ccc(cc1)C(c1ncc[nH]1)(c1ccc(Cl)cc1)n1ccnc1
: