Target
Glutamate receptor 1
Ligand
BDBM50004897
Substrate
Meas. Tech.
ChEBML_90137
Ki
>100000±n/a nM
Citation
 Whitten, JPBaron, BMMuench, DMiller, FWhite, HSMcDonald, IA (R)-4-oxo-5-phosphononorvaline: a new competitive glutamate antagonist at the NMDA receptor complex. J Med Chem 33:2961-3 (1990)  
Target
Name:
Glutamate receptor 1
Synonyms:
AMPA-selective glutamate receptor 1 GluA1 GluR-A Glur1 Gria1
Type:
Protein
Mol. Mass.:
101583.91
Organism:
Rattus norvegicus (Rat)
Description:
P19490
Residue:
907
  
Inhibitor
Name:
BDBM50004897
Synonyms:
(APV)2-Amino-5-phosphono-pentanoic acid (R)-2-amino-5-phosphonopentanoicacid 2-Amino-5-phosphono-pentanoic acid anion 2-Amino-5-phosphono-pentanoic acid(R-AP5) CHEMBL28862 DL-2-amino-5-phosphonovaleric acid
Type:
Small organic molecule
Emp. Form.:
C5H12NO5P
Mol. Mass.:
197.1262
SMILES:
NC(CCCP(O)(O)=O)C(O)=O
: