Target
Glutamate receptor ionotropic, kainate 3
Ligand
BDBM50004897
Substrate
Meas. Tech.
ChEBML_88659
Ki
>100000±n/a nM
Citation
 Whitten, JPBaron, BMMuench, DMiller, FWhite, HSMcDonald, IA (R)-4-oxo-5-phosphononorvaline: a new competitive glutamate antagonist at the NMDA receptor complex. J Med Chem 33:2961-3 (1990)  
Target
Name:
Glutamate receptor ionotropic, kainate 3
Synonyms:
GRIK3_RAT Glutamate receptor ionotropic kainate 3 Grik3
Type:
PROTEIN
Mol. Mass.:
104080.46
Organism:
Rattus norvegicus
Description:
ChEMBL_1447329
Residue:
919
  
Inhibitor
Name:
BDBM50004897
Synonyms:
(APV)2-Amino-5-phosphono-pentanoic acid (R)-2-amino-5-phosphonopentanoicacid 2-Amino-5-phosphono-pentanoic acid anion 2-Amino-5-phosphono-pentanoic acid(R-AP5) CHEMBL28862 DL-2-amino-5-phosphonovaleric acid
Type:
Small organic molecule
Emp. Form.:
C5H12NO5P
Mol. Mass.:
197.1262
SMILES:
NC(CCCP(O)(O)=O)C(O)=O
: