Target
Histamine H1 receptor
Ligand
BDBM50002091
Substrate
Meas. Tech.
ChEBML_83429
Ki
20±n/a nM
Citation
 Ohshima, EOtaki, SSato, HKumazawa, TObase, HIshii, AIshii, HOhmori, KHirayama, N Synthesis and antiallergic activity of 11-(aminoalkylidene)-6,11-dihydrodibenz[b,e]oxepin derivatives. J Med Chem 35:2074-84 (1992)  
Target
Name:
Histamine H1 receptor
Synonyms:
HISTAMINE H1 HRH1_CAVPO
Type:
G Protein-Coupled Receptor (GPCR)
Mol. Mass.:
55641.53
Organism:
Cavia porcellus (domestic guinea pig)
Description:
Guinea pig cerebellum was used in binding assay.
Residue:
488
  
Inhibitor
Name:
BDBM50002091
Synonyms:
11-(3-Dimethylamino-propylidene)-6,11-dihydro-dibenzo[b,e]oxepine-2-carboxylic acid | CHEMBL64067
Type:
Small organic molecule
Emp. Form.:
C20H21NO3
Mol. Mass.:
323.3856
SMILES:
CN(C)CC\C=C1\c2ccccc2COc2ccc(cc12)C(O)=O
: